BDBM50412955 CHEMBL407706
SMILES COc1ccc(cc1NS(=O)(=O)c1ccc(cc1)-c1ccc(C)o1)N1C[C@H](C)N[C@H](C)C1
InChI Key InChIKey=CBXAVILHOBZVOY-CALCHBBNSA-N
Data  1 KI  2 EC50
  Tab Delimited (TSV)   2D SDfile   Computed 3D by Vconf -m prep SDfile
Find this compound or compounds like it in BindingDB:
Activity Spreadsheet -- Enzyme Inhibition Constant Data from BindingDB
Found 3 hits for monomerid = 50412955
Target5-hydroxytryptamine receptor 1B(Homo sapiens (Human))
Glaxosmithkline
Curated by ChEMBL
LigandPNGBDBM50412955(CHEMBL407706)
Affinity DataKi: <3.16E+3nM. Assay description: Binding affinity to 5HT1B receptor
In DepthDetails ArticlePubMed
TargetGrowth hormone secretagogue receptor type 1(Homo sapiens (Human))
Glaxosmithkline
Curated by ChEMBL
LigandPNGBDBM50412955(CHEMBL407706)
Affinity DataEC50:  0.794nM. Assay description: Agonist activity at human ghrelin receptor by cell based BACMAM FLIPR assay
In DepthDetails ArticlePubMed
TargetGrowth hormone secretagogue receptor type 1(Homo sapiens (Human))
Glaxosmithkline
Curated by ChEMBL
LigandPNGBDBM50412955(CHEMBL407706)
Affinity DataEC50:  0.794nM. Assay description: Agonist activity at human GHSR1a by FLIPR assay
In DepthDetails ArticlePubMed