BDBM50413179 CHEMBL472054
SMILES NC(NC(=O)CC(c1ccc(Cl)cc1)c1ccc(Cl)cc1)=NCCCc1cnc[nH]1
InChI Key InChIKey=QVNIEBVJHOQXJI-UHFFFAOYSA-N
Data  1 EC50
  Tab Delimited (TSV)   2D SDfile   Computed 3D by Vconf -m prep SDfile
Find this compound or compounds like it in BindingDB:
Activity Spreadsheet -- Enzyme Inhibition Constant Data from BindingDB
Found 1 hit for monomerid = 50413179
TargetHistamine H2 receptor(Cavia porcellus (domestic guinea pig))
University Of Regensburg
Curated by ChEMBL
LigandPNGBDBM50413179(CHEMBL472054)
Affinity DataEC50:  309nM. Assay description: Agonist activity at histamine H2 receptor in guinea pig spontaneously beating right atrium assessed as positive chronotropic activity
In DepthDetails ArticlePubMed