BDBM50413272 AC-261066::CHEMBL198997
SMILES CCCCOCCOc1nc(sc1C)-c1ccc(C(O)=O)c(F)c1
InChI Key InChIKey=HSAOETBFVAWNRP-UHFFFAOYSA-N
Data  8 EC50
  Tab Delimited (TSV)   2D SDfile   Computed 3D by Vconf -m prep SDfile
Find this compound or compounds like it in BindingDB:
Activity Spreadsheet -- Enzyme Inhibition Constant Data from BindingDB
Found 8 hits for monomerid = 50413272
TargetRetinoic acid receptor beta(Homo sapiens (Human))
Acadia Pharmaceuticals
Curated by ChEMBL
LigandPNGBDBM50413272(AC-261066 | CHEMBL198997)
Affinity DataEC50:  7.94nM. Assay description: Agonist activity at RARbeta2 expressed in mouse NIH3T3 cells by R-SAT assay
In DepthDetails ArticlePubMed
TargetRetinoic acid receptor alpha(Homo sapiens (Human))
Acadia Pharmaceuticals
Curated by ChEMBL
LigandPNGBDBM50413272(AC-261066 | CHEMBL198997)
Affinity DataEC50:  631nM. Assay description: Activity at RARalpha expressed in mouse NIH3T3 cells by R-SAT assay
In DepthDetails ArticlePubMed
TargetRetinoic acid receptor beta(Homo sapiens (Human))
Acadia Pharmaceuticals
Curated by ChEMBL
LigandPNGBDBM50413272(AC-261066 | CHEMBL198997)
Affinity DataEC50:  398nM. Assay description: Activity at RARbeta1 expressed in mouse NIH3T3 cells by R-SAT assay
In DepthDetails ArticlePubMed
TargetRetinoic acid receptor alpha(Mus musculus)
King'S College
Curated by ChEMBL
LigandPNGBDBM50413272(AC-261066 | CHEMBL198997)
Affinity DataEC50:  70nM. Assay description: Transactivation of GAL4-fused mouse RARalpha-LBD expressed in COS-7 cells after 24 hrs by bright-Glo reagent based assay
In DepthDetails ArticlePubMed
TargetRetinoic acid receptor beta(Homo sapiens (Human))
Acadia Pharmaceuticals
Curated by ChEMBL
LigandPNGBDBM50413272(AC-261066 | CHEMBL198997)
Affinity DataEC50:  10nM. Assay description: Transcriptional activity against RARbeta2
In DepthDetails ArticlePubMed
TargetRetinoic acid receptor beta(Mus musculus)
King'S College
Curated by ChEMBL
LigandPNGBDBM50413272(AC-261066 | CHEMBL198997)
Affinity DataEC50:  12nM. Assay description: Transactivation of GAL4-fused mouse RARbeta-LBD expressed in COS-7 cells after 24 hrs by bright-Glo reagent based assay
In DepthDetails ArticlePubMed
TargetRetinoic acid receptor gamma(Mus musculus)
King'S College
Curated by ChEMBL
LigandPNGBDBM50413272(AC-261066 | CHEMBL198997)
Affinity DataEC50:  5.80nM. Assay description: Transactivation of GAL4-fused mouse RARgamma-LBD expressed in COS-7 cells after 24 hrs by bright-Glo reagent based assay
In DepthDetails ArticlePubMed
TargetRetinoic acid receptor gamma(Homo sapiens (Human))
Acadia Pharmaceuticals
Curated by ChEMBL
LigandPNGBDBM50413272(AC-261066 | CHEMBL198997)
Affinity DataEC50:  501nM. Assay description: Activity at RARgamma expressed in mouse NIH3T3 cells by R-SAT assay
In DepthDetails ArticlePubMed