BDBM50413740 CHEMBL61915
SMILES OC[C@H]1O[C@H]([C@H](O)[C@@H]1O)n1cnc2c(SCc3ccc(cc3)C#N)ncnc12
InChI Key InChIKey=YRFHAYJJVGLEQC-SCFUHWHPSA-N
Data  2 KI  2 IC50
  Tab Delimited (TSV)   2D SDfile   Computed 3D by Vconf -m prep SDfile
Find this compound or compounds like it in BindingDB:
Activity Spreadsheet -- Enzyme Inhibition Constant Data from BindingDB
Found 4 hits for monomerid = 50413740
TargetEquilibrative nucleoside transporter 1(Homo sapiens (Human))
University Of Tennessee Health Sciences Center
Curated by ChEMBL
LigandPNGBDBM50413740(CHEMBL61915)
Affinity DataKi:  4.57nM. Assay description: Inhibition of human ENT1
In DepthDetails ArticlePubMed
TargetAdenosine kinase(Toxoplasma gondii)TBA
LigandPNGBDBM50413740(CHEMBL61915)
Affinity DataKi:  900nM. Assay description: Inhibition of Toxoplasma gondii adenosine kinase
In DepthDetails Article
TargetAdenosine kinase(Toxoplasma gondii)TBA
LigandPNGBDBM50413740(CHEMBL61915)
Affinity DataIC50:  4.30E+3nM. Assay description: Inhibition of Toxoplasma gondii adenosine kinase
In DepthDetails Article
TargetAdenosine kinase(Toxoplasma gondii)TBA
LigandPNGBDBM50413740(CHEMBL61915)
Affinity DataIC50:  4.30E+3nM. Assay description: Inhibition of Toxoplasma gondii adenosine kinase
In DepthDetails Article