BDBM50413753 CHEMBL468931
SMILES CC(C)NC(=O)N1CCN(CC1)C(c1ccc(Cl)cc1)c1ccccc1Cl
InChI Key InChIKey=VFGYFLXLYLUGDR-UHFFFAOYSA-N
Data  1 IC50
  Tab Delimited (TSV)   2D SDfile   Computed 3D by Vconf -m prep SDfile
Find this compound or compounds like it in BindingDB:
Activity Spreadsheet -- Enzyme Inhibition Constant Data from BindingDB
Found 1 hit for monomerid = 50413753
TargetCannabinoid receptor 1(Homo sapiens (Human))
Korea Research Institute Of Chemical Technology
Curated by ChEMBL
LigandPNGBDBM50413753(CHEMBL468931)
Affinity DataIC50:  398nM. Assay description: Antagonist activity against human recombinant cannabinoid-1 receptor
In DepthDetails ArticlePubMed