BDBM50414088 CHEMBL540922
SMILES O=C1Nc2ccccc2C1=Cc1c[nH]c2ncccc12
InChI Key InChIKey=DYDCDWVYRSJCRI-UHFFFAOYSA-N
Data  1 KI
  Tab Delimited (TSV)   2D SDfile   Computed 3D by Vconf -m prep SDfile
Find this compound or compounds like it in BindingDB:
Activity Spreadsheet -- Enzyme Inhibition Constant Data from BindingDB
Found 1 hit for monomerid = 50414088
TargetSerine/threonine-protein kinase Chk1(Homo sapiens (Human))
Abbott Laboratories
Curated by ChEMBL
LigandPNGBDBM50414088(CHEMBL540922)
Affinity DataKi:  2.00E+3nM. Assay description: Inhibition of Chk1
In DepthDetails ArticlePubMed