BDBM50414120 CHEMBL549732
SMILES Nc1ccc2cccc(OCc3ccccc3C#N)c2n1
InChI Key InChIKey=MBPMOGNYMFONSB-UHFFFAOYSA-N
Data  1 KI
  Tab Delimited (TSV)   2D SDfile   Computed 3D by Vconf -m prep SDfile
Find this compound or compounds like it in BindingDB:
Activity Spreadsheet -- Enzyme Inhibition Constant Data from BindingDB
Found 1 hit for monomerid = 50414120
TargetUrokinase-type plasminogen activator(Homo sapiens (Human))
Abbott Laboratories
Curated by ChEMBL
LigandPNGBDBM50414120(CHEMBL549732)
Affinity DataKi:  3.16E+4nM. Assay description: Inhibition of urokinase
In DepthDetails ArticlePubMed