BDBM50414145 CHEMBL542009
SMILES CCc1cc(CC(NC(C)=O)C(=O)NCCCCC(=O)NC(Cc2cccs2)C(O)=O)ccc1N(C(=O)C(O)=O)c1ccccc1C(O)=O
InChI Key InChIKey=PWTDUBXYYDWONP-UHFFFAOYSA-N
Data  1 KI
  Tab Delimited (TSV)   2D SDfile   Computed 3D by Vconf -m prep SDfile
Find this compound or compounds like it in BindingDB:
Activity Spreadsheet -- Enzyme Inhibition Constant Data from BindingDB
Found 1 hit for monomerid = 50414145
TargetTyrosine-protein phosphatase non-receptor type 1(Homo sapiens (Human))
Abbott Laboratories
Curated by ChEMBL
LigandPNGBDBM50414145(CHEMBL542009)
Affinity DataKi:  398nM. Assay description: Inhibition of PTP1B
In DepthDetails ArticlePubMed