BDBM50414189 CHEMBL541952
SMILES COC(=O)NC(Cc1ccc(cc1)N(C(=O)C(O)=O)c1ccccc1C(O)=O)C(=O)NCCCCOc1cc(cc(O)c1C(=O)OC)-c1ccccc1
InChI Key InChIKey=IAKJTICRYFGEDI-UHFFFAOYSA-N
Data  1 KI
  Tab Delimited (TSV)   2D SDfile   Computed 3D by Vconf -m prep SDfile
Find this compound or compounds like it in BindingDB:
Activity Spreadsheet -- Enzyme Inhibition Constant Data from BindingDB
Found 1 hit for monomerid = 50414189
TargetTyrosine-protein phosphatase non-receptor type 1(Homo sapiens (Human))
Abbott Laboratories
Curated by ChEMBL
LigandPNGBDBM50414189(CHEMBL541952)
Affinity DataKi:  1.00E+3nM. Assay description: Inhibition of PTP1B
In DepthDetails ArticlePubMed