BDBM50414392 CHEMBL1202329
SMILES Cc1ccc(CN=C(N)SCCCc2cnc[nH]2)cc1
InChI Key InChIKey=OVYKUTIVKUFDSG-UHFFFAOYSA-N
Data  2 KI
  Tab Delimited (TSV)   2D SDfile   Computed 3D by Vconf -m prep SDfile
Find this compound or compounds like it in BindingDB:
Activity Spreadsheet -- Enzyme Inhibition Constant Data from BindingDB
Found 2 hits for monomerid = 50414392
TargetHistamine H3 receptor(Homo sapiens (Human))
Vu University Amsterdam
Curated by ChEMBL
LigandPNGBDBM50414392(CHEMBL1202329)
Affinity DataKi:  6.31nM. Assay description: Displacement of [3H]N-alpha-methylhistamine from human histamine H3 receptor expressed in human SK-N-MC cells by liquid scintillation counting
In DepthDetails ArticlePubMed
TargetHistamine H4 receptor(Homo sapiens (Human))
Vu University Amsterdam
Curated by ChEMBL
LigandPNGBDBM50414392(CHEMBL1202329)
Affinity DataKi:  25.1nM. Assay description: Displacement of [3H]histamine from human histamine H4 receptor expressed in human SK-N-MC cells by liquid scintillation counting
In DepthDetails ArticlePubMed