BDBM50414652 CHEMBL559941
SMILES CC(C)CC[C@@H](O)[C@](C)(O)[C@H]1CC[C@H]2[C@@H]3CC(=O)[C@H]4C[C@H](O)CC[C@]4(C)[C@H]3CC[C@]12C
InChI Key InChIKey=BMTTUHNUPKSNHI-NBNOIDAGSA-N
Data  1 IC50
  Tab Delimited (TSV)   2D SDfile   Computed 3D by Vconf -m prep SDfile
Find this compound or compounds like it in BindingDB:
Activity Spreadsheet -- Enzyme Inhibition Constant Data from BindingDB
Found 1 hit for monomerid = 50414652
TargetEcdysone receptor(Drosophila melanogaster)
Kyoto University
Curated by ChEMBL
LigandPNGBDBM50414652(CHEMBL559941)
Affinity DataIC50:  794nM. Assay description: Binding affinity to ecdysone receptor ligand binding domain in Drosophila melanogaster assessed as number of hydrogen bonds formed
In DepthDetails ArticlePubMed