BDBM50414711 CHEMBL558261
SMILES COc1cc(N)c(Cl)cc1C(=O)NC1CCN(CCCCCCCCN2CCN(CC2)S(C)(=O)=O)CC1
InChI Key InChIKey=RRPJYWDXMJNRSL-UHFFFAOYSA-N
Data  1 KI  1 EC50
  Tab Delimited (TSV)   2D SDfile   Computed 3D by Vconf -m prep SDfile
Find this compound or compounds like it in BindingDB:
Activity Spreadsheet -- Enzyme Inhibition Constant Data from BindingDB
Found 2 hits for monomerid = 50414711
Target5-hydroxytryptamine receptor 4(Homo sapiens (Human))
Theravance
Curated by ChEMBL
LigandPNGBDBM50414711(CHEMBL558261)
Affinity DataKi:  15.8nM. Assay description: Displacement of [H]GR-113808 from human 5HT4C receptor expressed in HEK293 cells by liquid scintillation counting
In DepthDetails ArticlePubMed
Target5-hydroxytryptamine receptor 4(Homo sapiens (Human))
Theravance
Curated by ChEMBL
LigandPNGBDBM50414711(CHEMBL558261)
Affinity DataEC50:  39.8nM. Assay description: Agonist activity at human 5HT4C receptor expressed in HEK293 cells assessed as acumulation of cAMP by flash plate adenylyl cyclase activation assay
In DepthDetails ArticlePubMed