BDBM50414723 CHEMBL540980
SMILES [H][C@]12CC[C@]([H])(C[C@@H](C1)NC(=O)c1cc3ccccc3n(C(C)C)c1=O)N2CCCN1CCN(CC1)C(=O)OCC
InChI Key InChIKey=YFJVXDKQWHEAPD-QEIWAGNOSA-N
Data  1 KI  1 EC50
  Tab Delimited (TSV)   2D SDfile   Computed 3D by Vconf -m prep SDfile
Find this compound or compounds like it in BindingDB:
Activity Spreadsheet -- Enzyme Inhibition Constant Data from BindingDB
Found 2 hits for monomerid = 50414723
Target5-hydroxytryptamine receptor 4(Homo sapiens (Human))
Theravance
Curated by ChEMBL
LigandPNGBDBM50414723(CHEMBL540980)
Affinity DataKi:  39.8nM. Assay description: Displacement of [H]GR-113808 from human 5HT4C receptor expressed in HEK293 cells by liquid scintillation counting
In DepthDetails ArticlePubMed
Target5-hydroxytryptamine receptor 4(Homo sapiens (Human))
Theravance
Curated by ChEMBL
LigandPNGBDBM50414723(CHEMBL540980)
Affinity DataEC50:  2.51nM. Assay description: Agonist activity at human 5HT4C receptor expressed in HEK293 cells assessed as acumulation of cAMP by flash plate adenylyl cyclase activation assay
In DepthDetails ArticlePubMed