BDBM50414792 CHEMBL573817
SMILES C(CN1CCCCC1)C#Cc1cccc(CN2CCCCC2)c1
InChI Key InChIKey=UIDQQTHLSRGAPO-UHFFFAOYSA-N
Data  1 KI
  Tab Delimited (TSV)   2D SDfile   Computed 3D by Vconf -m prep SDfile
Find this compound or compounds like it in BindingDB:
Activity Spreadsheet -- Enzyme Inhibition Constant Data from BindingDB
Found 1 hit for monomerid = 50414792
TargetHistamine H3 receptor(Homo sapiens (Human))
Johnson & Johnson Pharmaceutical Research & Development
Curated by ChEMBL
LigandPNGBDBM50414792(CHEMBL573817)
Affinity DataKi:  0.776nM. Assay description: Displacement of [3H]N-alpha-methylhistamine from human histamine H3 receptor expressed in SK-N-MC cells
In DepthDetails ArticlePubMed