BDBM50414920 CHEMBL571495
SMILES CCCCC\C=C/C\C=C/C\C=C/C\C=C/CCCCN1C(=O)CCC1=O
InChI Key InChIKey=SQSHBJWLWQSASB-DOFZRALJSA-N
Data  2 IC50
  Tab Delimited (TSV)   2D SDfile   Computed 3D by Vconf -m prep SDfile
Find this compound or compounds like it in BindingDB:
Activity Spreadsheet -- Enzyme Inhibition Constant Data from BindingDB
Found 2 hits for monomerid = 50414920
TargetFatty-acid amide hydrolase 1(Homo sapiens (Human))
Universite Catholique De Louvain
Curated by ChEMBL
LigandPNGBDBM50414920(CHEMBL571495)
Affinity DataIC50:  2.19E+3nM. Assay description: Inhibition of human recombinant FAAH-maltose binding protein
In DepthDetails ArticlePubMed
TargetMonoglyceride lipase(Homo sapiens (Human))
Universite Catholique De Louvain
Curated by ChEMBL
LigandPNGBDBM50414920(CHEMBL571495)
Affinity DataIC50:  1.12E+3nM. Assay description: Inhibition of human MGL activity using [3H]2-oleoylglycerol substrate by liquid scintillation counting
In DepthDetails ArticlePubMed