BDBM50414937 CHEMBL583524
SMILES S=C(SSC(=S)N1CCc2ccccc2C1)N1CCc2ccccc2C1
InChI Key InChIKey=RXSZRGMRAQEECZ-UHFFFAOYSA-N
Data  3 IC50
  Tab Delimited (TSV)   2D SDfile   Computed 3D by Vconf -m prep SDfile
Find this compound or compounds like it in BindingDB:
Activity Spreadsheet -- Enzyme Inhibition Constant Data from BindingDB
Found 4 hits for monomerid = 50414937
TargetFatty-acid amide hydrolase 1(Homo sapiens (Human))
Universite Catholique De Louvain
Curated by ChEMBL
LigandPNGBDBM50414937(CHEMBL583524)
Affinity DataIC50: >1.00E+6nM. Assay description: Inhibition of human recombinant FAAH-maltose binding protein
In DepthDetails ArticlePubMed
TargetD-3-phosphoglycerate dehydrogenase(Homo sapiens (Human))TBA
LigandPNGBDBM50414937(CHEMBL583524)
Affinity DataIC50:  380nM
In DepthDetails
TargetFructose-1,6-bisphosphatase 1(Homo sapiens (Human))
East China University Of Science And Technology
Curated by ChEMBL
LigandPNGBDBM50414937(CHEMBL583524)
Affinity DataIC50: >1.00E+4nM. Assay description: Inhibition of wild-type full-length human liver FBPase expressed in Escherichia coli BL21 (DE3) using FBP as substrate by malachite green dye based a...
In DepthDetails ArticlePubMed
TargetMonoglyceride lipase(Homo sapiens (Human))
Universite Catholique De Louvain
Curated by ChEMBL
LigandPNGBDBM50414937(CHEMBL583524)
Affinity DataIC50:  347nM. Assay description: Inhibition of human MGL activity using [3H]2-oleoylglycerol substrate by liquid scintillation counting
In DepthDetails ArticlePubMed