BDBM50415159 CHEMBL570789
SMILES C(N1CCC2(CC1)CCc1ccccc1C2)c1ccccc1
InChI Key InChIKey=BWLYRCBLFWFPHN-UHFFFAOYSA-N
Data  1 KI
  Tab Delimited (TSV)   2D SDfile   Computed 3D by Vconf -m prep SDfile
Find this compound or compounds like it in BindingDB:
Activity Spreadsheet -- Enzyme Inhibition Constant Data from BindingDB
Found 1 hit for monomerid = 50415159
TargetSigma non-opioid intracellular receptor 1(Homo sapiens (Human))
Universit£
Curated by ChEMBL
LigandPNGBDBM50415159(CHEMBL570789)
Affinity DataKi:  0.437nM. Assay description: Displacement of [3H](+)-pentazocine from sigma1 receptor in human Jurkat cell membrane
In DepthDetails ArticlePubMed