BDBM50415196 CHEMBL593571
SMILES CC(C)Cn1c(=O)n(Cc2ccco2)c2nc(Cc3ccccc3)[nH]c2c1=O
InChI Key InChIKey=ZYPXRLCRQCQKNI-UHFFFAOYSA-N
Data  1 KI
  Tab Delimited (TSV)   2D SDfile   Computed 3D by Vconf -m prep SDfile
Find this compound or compounds like it in BindingDB:
Activity Spreadsheet -- Enzyme Inhibition Constant Data from BindingDB
Found 1 hit for monomerid = 50415196
TargetAdenosine receptor A1(Rattus norvegicus (rat))
Universidade De Santiago De Compostela
Curated by ChEMBL
LigandPNGBDBM50415196(CHEMBL593571)
Affinity DataKi:  490nM. Assay description: Displacement of [3H]DPCPX form adenosine A1 receptor in rat cortex membrane
In DepthDetails ArticlePubMed