BDBM50415263 CHEMBL590833
SMILES Cc1cc(F)ccc1[C@H]1CNCCN1C(=O)N1CCCC1c1cc(cc(c1)C(F)(F)F)C(F)(F)F
InChI Key InChIKey=MXMABCVCSRDSMR-BPGUCPLFSA-N
Data  2 KI
  Tab Delimited (TSV)   2D SDfile   Computed 3D by Vconf -m prep SDfile
Find this compound or compounds like it in BindingDB:
Activity Spreadsheet -- Enzyme Inhibition Constant Data from BindingDB
Found 2 hits for monomerid = 50415263
TargetSubstance-P receptor(Homo sapiens (Human))
Glaxosmithkline
Curated by ChEMBL
LigandPNGBDBM50415263(CHEMBL590833)
Affinity DataKi:  63.1nM. Assay description: Displacement of [3H]substance P from human NK1 receptor expressed in CHO cells
In DepthDetails ArticlePubMed
TargetSubstance-P receptor(Homo sapiens (Human))
Glaxosmithkline
Curated by ChEMBL
LigandPNGBDBM50415263(CHEMBL590833)
Affinity DataKi:  63.1nM. Assay description: Displacement of [3H]substance P from human NK1 receptor expressed in CHO cells
In DepthDetails ArticlePubMed