BDBM50415337 CHEMBL602075
SMILES COc1ccc(cc1CC(=O)N1CCC(CC1)n1c2cccnc2[nH]c1=O)-c1ccccc1
InChI Key InChIKey=QYCUSUSETGZGED-UHFFFAOYSA-N
Data  1 KI
  Tab Delimited (TSV)   2D SDfile   Computed 3D by Vconf -m prep SDfile
Find this compound or compounds like it in BindingDB:
Activity Spreadsheet -- Enzyme Inhibition Constant Data from BindingDB
Found 1 hit for monomerid = 50415337
TargetCalcitonin gene-related peptide type 1 receptor(Homo sapiens (Human))
Glaxosmithkline
Curated by ChEMBL
LigandPNGBDBM50415337(CHEMBL602075)
Affinity DataKi:  2.51E+3nM. Assay description: Antagonist activity at human recombinant CGRP receptor expressed in HEK293 cells assessed as inhibition of CGRP-stimulated increase of intracellular ...
In DepthDetails ArticlePubMed