BDBM50415361 CHEMBL592649
SMILES FC(F)CN1CCC(CC1)c1cc(Cl)cc(c1)-c1nnc(CC(=O)N2CCC(CC2)n2c3cccnc3[nH]c2=O)o1
InChI Key InChIKey=NDKDMCYHUVSCEC-UHFFFAOYSA-N
Data  2 KI
  Tab Delimited (TSV)   2D SDfile   Computed 3D by Vconf -m prep SDfile
Find this compound or compounds like it in BindingDB:
Activity Spreadsheet -- Enzyme Inhibition Constant Data from BindingDB
Found 2 hits for monomerid = 50415361
TargetCalcitonin gene-related peptide type 1 receptor(Homo sapiens (Human))
Glaxosmithkline
Curated by ChEMBL
LigandPNGBDBM50415361(CHEMBL592649)
Affinity DataKi:  3.98nM. Assay description: Antagonist activity at human recombinant CGRP receptor expressed in HEK293 cells assessed as inhibition of CGRP-stimulated increase of intracellular ...
In DepthDetails ArticlePubMed
TargetCalcitonin gene-related peptide type 1 receptor(Homo sapiens (Human))
Glaxosmithkline
Curated by ChEMBL
LigandPNGBDBM50415361(CHEMBL592649)
Affinity DataKi:  79.4nM. Assay description: Antagonist activity at human recombinant CGRP receptor expressed in HEK293 cells assessed as inhibition of CGRP-stimulated increase of intracellular ...
In DepthDetails ArticlePubMed