BDBM50415362 CHEMBL601857
SMILES Cc1ncc(-c2cc(Cl)cc(c2)-c2nnc(CC(=O)N3CCC(CC3)n3c4cccnc4[nH]c3=O)o2)n1C
InChI Key InChIKey=CFQOXXLFJBIIEK-UHFFFAOYSA-N
Data  2 KI
  Tab Delimited (TSV)   2D SDfile   Computed 3D by Vconf -m prep SDfile
Find this compound or compounds like it in BindingDB:
Activity Spreadsheet -- Enzyme Inhibition Constant Data from BindingDB
Found 2 hits for monomerid = 50415362
TargetCalcitonin gene-related peptide type 1 receptor(Homo sapiens (Human))
Glaxosmithkline
Curated by ChEMBL
LigandPNGBDBM50415362(CHEMBL601857)
Affinity DataKi:  1.58nM. Assay description: Antagonist activity at human recombinant CGRP receptor expressed in HEK293 cells assessed as inhibition of CGRP-stimulated increase of intracellular ...
In DepthDetails ArticlePubMed
TargetCalcitonin gene-related peptide type 1 receptor(Homo sapiens (Human))
Glaxosmithkline
Curated by ChEMBL
LigandPNGBDBM50415362(CHEMBL601857)
Affinity DataKi:  100nM. Assay description: Antagonist activity at human recombinant CGRP receptor expressed in HEK293 cells assessed as inhibition of CGRP-stimulated increase of intracellular ...
In DepthDetails ArticlePubMed