BDBM50415482 CHEMBL591011
SMILES CNS(=O)(=O)CCNc1nc(nc2ccc(Cl)cc12)N1CCN(C)CC1
InChI Key InChIKey=YJBYCNMZDWJKLC-UHFFFAOYSA-N
Data  1 KI
  Tab Delimited (TSV)   2D SDfile   Computed 3D by Vconf -m prep SDfile
Find this compound or compounds like it in BindingDB:
Activity Spreadsheet -- Enzyme Inhibition Constant Data from BindingDB
Found 1 hit for monomerid = 50415482
TargetHistamine H4 receptor(Homo sapiens (Human))
Griffin Discoveries
Curated by ChEMBL
LigandPNGBDBM50415482(CHEMBL591011)
Affinity DataKi:  4.27nM. Assay description: Displacement of [3H]histamine from human histamine H4 receptor expressed in HEK293T cells
In DepthDetails ArticlePubMed