BDBM50415494 CHEMBL592434
SMILES CN1CCN(CC1)c1nc(NCCS(=O)(=O)Nc2ccccc2)c2cc(I)ccc2n1
InChI Key InChIKey=WZOKLBSIICZOIU-UHFFFAOYSA-N
Data  1 KI
  Tab Delimited (TSV)   2D SDfile   Computed 3D by Vconf -m prep SDfile
Find this compound or compounds like it in BindingDB:
Activity Spreadsheet -- Enzyme Inhibition Constant Data from BindingDB
Found 1 hit for monomerid = 50415494
TargetHistamine H4 receptor(Homo sapiens (Human))
Griffin Discoveries
Curated by ChEMBL
LigandPNGBDBM50415494(CHEMBL592434)
Affinity DataKi:  5.75nM. Assay description: Displacement of [3H]histamine from human histamine H4 receptor expressed in HEK293T cells
In DepthDetails ArticlePubMed