BDBM50415603 CHEMBL1086785
SMILES COc1cccc(c1)C1=NCCc2cc(OC)c(OC)cc12
InChI Key InChIKey=OGVNHOMELRLNEM-UHFFFAOYSA-N
Data  2 IC50
  Tab Delimited (TSV)   2D SDfile   Computed 3D by Vconf -m prep SDfile
Find this compound or compounds like it in BindingDB:
Activity Spreadsheet -- Enzyme Inhibition Constant Data from BindingDB
Found 2 hits for monomerid = 50415603
TargetMitogen-activated protein kinase 14(Homo sapiens (Human))
Glaxosmithkline
Curated by ChEMBL
LigandPNGBDBM50415603(CHEMBL1086785)
Affinity DataIC50: >1.58E+4nM. Assay description: Inhibition of N-terminal GST-tagged p38alpha expressed in Escherichia coli by fluorescence anisotropy
In DepthDetails ArticlePubMed
TargetMitogen-activated protein kinase 10(Homo sapiens (Human))
Glaxosmithkline
Curated by ChEMBL
LigandPNGBDBM50415603(CHEMBL1086785)
Affinity DataIC50: >1.58E+4nM. Assay description: Inhibition of N-terminal His(6)-tagged truncated human JNK3 transfected in baculovirus expression system by fluorescence anisotropy
In DepthDetails ArticlePubMed