BDBM50415799 CHEMBL1093352
SMILES Cn1ncc2c(Cl)c(cnc12)C(=O)NCc1ccccc1
InChI Key InChIKey=NZWMGVYGGYAWCY-UHFFFAOYSA-N
Data  1 IC50
  Tab Delimited (TSV)   2D SDfile   Computed 3D by Vconf -m prep SDfile
Find this compound or compounds like it in BindingDB:
Activity Spreadsheet -- Enzyme Inhibition Constant Data from BindingDB
Found 1 hit for monomerid = 50415799
TargetGlucocorticoid receptor(Homo sapiens (Human))
Medicines Research Centre
Curated by ChEMBL
LigandPNGBDBM50415799(CHEMBL1093352)
Affinity DataIC50:  1.00E+3nM. Assay description: Antagonist activity at glucocorticoid receptor expressed in human A549 cells assessed as inhibition of cortisol-induced renilla luciferase transactiv...
In DepthDetails ArticlePubMed