BDBM50415827 CHEMBL1095245
SMILES Cc1ccc(OC(CCN2CCN(CC2)c2ccc(Cl)cc2)c2ccccc2)cc1
InChI Key InChIKey=HSSKUHYKFYVFRR-UHFFFAOYSA-N
Data  2 KI
  Tab Delimited (TSV)   2D SDfile   Computed 3D by Vconf -m prep SDfile
Find this compound or compounds like it in BindingDB:
Activity Spreadsheet -- Enzyme Inhibition Constant Data from BindingDB
Found 2 hits for monomerid = 50415827
Target5-hydroxytryptamine receptor 1A(Homo sapiens (Human))
Universidade Federal Da Para£Ba
Curated by ChEMBL
LigandPNGBDBM50415827(CHEMBL1095245)
Affinity DataKi:  1.45E+3nM. Assay description: Antagonist activity at 5HT1A
In DepthDetails ArticlePubMed
Target5-hydroxytryptamine receptor 1A(Homo sapiens (Human))
Universidade Federal Da Para£Ba
Curated by ChEMBL
LigandPNGBDBM50415827(CHEMBL1095245)
Affinity DataKi:  1.45E+3nM. Assay description: Binding affinity to 5HT1A receptor
In DepthDetails ArticlePubMed