BDBM50415903 CHEMBL1094485
SMILES CN(Cc1ccc(F)cc1Cl)C(=O)Cc1c(C)nn(c1C)-c1ccccc1
InChI Key InChIKey=IFEPLNWGALSDIX-UHFFFAOYSA-N
Data  2 IC50
  Tab Delimited (TSV)   2D SDfile   Computed 3D by Vconf -m prep SDfile
Find this compound or compounds like it in BindingDB:
Activity Spreadsheet -- Enzyme Inhibition Constant Data from BindingDB
Found 2 hits for monomerid = 50415903
TargetP2X purinoceptor 7(Homo sapiens (Human))
Punjabi University
Curated by ChEMBL
LigandPNGBDBM50415903(CHEMBL1094485)
Affinity DataIC50: <1.00E+3nM. Assay description: Antagonist activity at P2X7 receptor (unknown origin)
In DepthDetails ArticlePubMed
TargetP2X purinoceptor 7(Homo sapiens (Human))
Punjabi University
Curated by ChEMBL
LigandPNGBDBM50415903(CHEMBL1094485)
Affinity DataIC50: >1.00E+3nM. Assay description: Inhibition of human P2X7 receptor assessed as inhibition of ethidium bromide accumulation
In DepthDetails ArticlePubMed