BDBM50415925 CHEMBL1084161
SMILES Cc1ccc2cc(sc2c1)C(=O)NC1(CCCC1)C(=O)N[C@@H](CCCN1CCN(CC1)S(N)(=O)=O)Cc1ccccc1
InChI Key InChIKey=ZLJOAFCXAUKYOF-SANMLTNESA-N
Data  1 KI
  Tab Delimited (TSV)   2D SDfile   Computed 3D by Vconf -m prep SDfile
Find this compound or compounds like it in BindingDB:
Activity Spreadsheet -- Enzyme Inhibition Constant Data from BindingDB
Found 1 hit for monomerid = 50415925
TargetSubstance-K receptor(Homo sapiens (Human))
Menarini Ricerche
Curated by ChEMBL
LigandPNGBDBM50415925(CHEMBL1084161)
Affinity DataKi:  0.631nM. Assay description: Displacement of [3H]neurokinin A from human NK2 receptor
In DepthDetails ArticlePubMed