BDBM50415929 CHEMBL1083880
SMILES Cc1ccc2cc(sc2c1)C(=O)NC1(CCCC1)C(=O)N[C@@H](CCCN1CCN(CC1)C(=O)c1cccn1C)Cc1ccccc1
InChI Key InChIKey=GEIAIWAMZLASTE-PMERELPUSA-N
Data  1 KI
  Tab Delimited (TSV)   2D SDfile   Computed 3D by Vconf -m prep SDfile
Find this compound or compounds like it in BindingDB:
Activity Spreadsheet -- Enzyme Inhibition Constant Data from BindingDB
Found 1 hit for monomerid = 50415929
TargetSubstance-K receptor(Homo sapiens (Human))
Menarini Ricerche
Curated by ChEMBL
LigandPNGBDBM50415929(CHEMBL1083880)
Affinity DataKi:  0.398nM. Assay description: Displacement of [3H]neurokinin A from human NK2 receptor
In DepthDetails ArticlePubMed