BDBM50415935 CHEMBL1083878
SMILES CCOCCCN1CCN(CCC[C@@H](Cc2ccccc2)NC(=O)C2(CCCC2)NC(=O)c2cc3ccc(C)cc3s2)CC1
InChI Key InChIKey=MOPHVRWHWYOJKJ-HKBQPEDESA-N
Data  1 KI
  Tab Delimited (TSV)   2D SDfile   Computed 3D by Vconf -m prep SDfile
Find this compound or compounds like it in BindingDB:
Activity Spreadsheet -- Enzyme Inhibition Constant Data from BindingDB
Found 1 hit for monomerid = 50415935
TargetSubstance-K receptor(Homo sapiens (Human))
Menarini Ricerche
Curated by ChEMBL
LigandPNGBDBM50415935(CHEMBL1083878)
Affinity DataKi:  0.316nM. Assay description: Displacement of [3H]neurokinin A from human NK2 receptor
In DepthDetails ArticlePubMed