BDBM50415963 CHEMBL1083561
SMILES O=C(NC1(CCCC1)C(=O)N[C@@H](CCCN1CCN(CC2CCOCC2)CC1)Cc1ccccc1)c1ccc2ccccc2c1
InChI Key InChIKey=ZXRIWIVIXXWDGK-DHUJRADRSA-N
Data  1 KI
  Tab Delimited (TSV)   2D SDfile   Computed 3D by Vconf -m prep SDfile
Find this compound or compounds like it in BindingDB:
Activity Spreadsheet -- Enzyme Inhibition Constant Data from BindingDB
Found 1 hit for monomerid = 50415963
TargetSubstance-K receptor(Homo sapiens (Human))
Menarini Ricerche
Curated by ChEMBL
LigandPNGBDBM50415963(CHEMBL1083561)
Affinity DataKi:  0.316nM. Assay description: Displacement of [3H]neurokinin A from human NK2 receptor
In DepthDetails ArticlePubMed