BDBM50416028 CHEMBL1085658
SMILES OC1CN(C[C@@H]2CCCc3cc(ccc23)S(=O)(=O)c2cccc(F)c2)C1
InChI Key InChIKey=FWFLTFAOXVWWON-HNNXBMFYSA-N
Data  1 KI
  Tab Delimited (TSV)   2D SDfile   Computed 3D by Vconf -m prep SDfile
Find this compound or compounds like it in BindingDB:
Activity Spreadsheet -- Enzyme Inhibition Constant Data from BindingDB
Found 1 hit for monomerid = 50416028
Target5-hydroxytryptamine receptor 6(Homo sapiens (Human))
Roche Palo Alto
Curated by ChEMBL
LigandPNGBDBM50416028(CHEMBL1085658)
Affinity DataKi:  0.100nM. Assay description: Displacement of [3H]LSD form human recombinant 5HT6 receptor
In DepthDetails ArticlePubMed