BDBM50416162 CHEMBL1084807
SMILES CN(CC1CCNCC1)S(=O)(=O)c1ccccc1-c1cccc(Cl)c1
InChI Key InChIKey=ALYOWQBRPGWMST-UHFFFAOYSA-N
Data  1 EC50
  Tab Delimited (TSV)   2D SDfile   Computed 3D by Vconf -m prep SDfile
Find this compound or compounds like it in BindingDB:
Activity Spreadsheet -- Enzyme Inhibition Constant Data from BindingDB
Found 1 hit for monomerid = 50416162
TargetMuscarinic acetylcholine receptor M1(Homo sapiens (Human))
Glaxosmithkline
Curated by ChEMBL
LigandPNGBDBM50416162(CHEMBL1084807)
Affinity DataEC50: >1.00E+4nM. Assay description: Agonist activity at human muscarinic M1 receptor expressed in CHO cells assessed as effect on acetylcholine-induced intracellular calcium level by FL...
In DepthDetails ArticlePubMed