BDBM50416335 CHEMBL1170168
SMILES CCCn1c2cc(-c3ccc(OCC(=O)N4CCc5ccccc5C4)cc3)n(C)c2c(=O)n(CCC)c1=O
InChI Key InChIKey=GBKLHMOLHDLNFA-UHFFFAOYSA-N
Data  1 KI
  Tab Delimited (TSV)   2D SDfile   Computed 3D by Vconf -m prep SDfile
Find this compound or compounds like it in BindingDB:
Activity Spreadsheet -- Enzyme Inhibition Constant Data from BindingDB
Found 1 hit for monomerid = 50416335
TargetAdenosine receptor A2b(Homo sapiens (Human))
Universidade De A Coru£A
Curated by ChEMBL
LigandPNGBDBM50416335(CHEMBL1170168)
Affinity DataKi:  97.7nM. Assay description: Displacement of [3H]DPCPX from human recombinant adenosine A2B receptor expressed in HEK293 cells after 30 mins
In DepthDetails ArticlePubMed