BDBM50416403 CHEMBL1210578
SMILES FC1(F)CCC(CC1)c1nn(CC(=O)NC2Cc3ccccc3C2)c(=O)c2ccncc12
InChI Key InChIKey=HTQKPVVITWAUOK-UHFFFAOYSA-N
Data  1 EC50
  Tab Delimited (TSV)   2D SDfile   Computed 3D by Vconf -m prep SDfile
Find this compound or compounds like it in BindingDB:
Activity Spreadsheet -- Enzyme Inhibition Constant Data from BindingDB
Found 1 hit for monomerid = 50416403
TargetNeuronal acetylcholine receptor subunit alpha-7(Homo sapiens (Human))
Glaxosmithkline
Curated by ChEMBL
LigandPNGBDBM50416403(CHEMBL1210578)
Affinity DataEC50:  10nM. Assay description: Positive allosteric modulator activity at human alpha7 nAChR expressed in rat GH4C1 assessed as calcium mobilization by FLIPR assay
In DepthDetails ArticlePubMed