BDBM50416411 CHEMBL1209867
SMILES COc1ccccc1NC(=O)N[C@H](C(=O)N(CCC1CCCC1)CC(=O)NO)C(C)(C)C
InChI Key InChIKey=HNSGWMSGWTXUNT-HXUWFJFHSA-N
Data  1 IC50
  Tab Delimited (TSV)   2D SDfile   Computed 3D by Vconf -m prep SDfile
Find this compound or compounds like it in BindingDB:
Activity Spreadsheet -- Enzyme Inhibition Constant Data from BindingDB
Found 1 hit for monomerid = 50416411
TargetPeptide deformylase(Pseudomonas aeruginosa)
Seoul National University
Curated by ChEMBL
LigandPNGBDBM50416411(CHEMBL1209867)
Affinity DataIC50:  31nM. Assay description: Inhibition of Pseudomonas aeruginosa Peptide deformylase by fluorescence analysis
In DepthDetails ArticlePubMed