BDBM50416731 CHEMBL1223941
SMILES COCCO[C@H]1CC[C@@](C)(CC1)N1CCC(CC1)n1c2cc(ccc2oc1=O)C#N
InChI Key InChIKey=GCEVFXMRGSNNRI-UILWBTOOSA-N
Data  5 EC50
  Tab Delimited (TSV)   2D SDfile   Computed 3D by Vconf -m prep SDfile
Find this compound or compounds like it in BindingDB:
Activity Spreadsheet -- Enzyme Inhibition Constant Data from BindingDB
Found 5 hits for monomerid = 50416731
TargetMuscarinic acetylcholine receptor M1(Homo sapiens (Human))
Glaxosmithkline
Curated by ChEMBL
LigandPNGBDBM50416731(CHEMBL1223941)
Affinity DataEC50:  10nM. Assay description: Agonist activity at human muscarinic M1 receptor expressed in CHO cells assessed as effect on calcium mobilization by FLIPR assay
In DepthDetails ArticlePubMed
TargetMuscarinic acetylcholine receptor M2(Homo sapiens (Human))
Glaxosmithkline
Curated by ChEMBL
LigandPNGBDBM50416731(CHEMBL1223941)
Affinity DataEC50:  2.51E+3nM. Assay description: Agonist activity at human muscarinic M2 receptor expressed in CHO cells co-expressing Gqi5 chimaeric G-protein assessed as effect on calcium mobiliza...
In DepthDetails ArticlePubMed
TargetMuscarinic acetylcholine receptor M5(Homo sapiens (Human))
Glaxosmithkline
Curated by ChEMBL
LigandPNGBDBM50416731(CHEMBL1223941)
Affinity DataEC50:  1.00E+3nM. Assay description: Agonist activity at human muscarinic M5 receptor expressed in CHO cells assessed as effect on calcium mobilization by FLIPR assay
In DepthDetails ArticlePubMed
TargetMuscarinic acetylcholine receptor M4(Homo sapiens (Human))
Glaxosmithkline
Curated by ChEMBL
LigandPNGBDBM50416731(CHEMBL1223941)
Affinity DataEC50:  794nM. Assay description: Agonist activity at human muscarinic M4 receptor expressed in CHO cells co-expressing Gqi5 chimaeric G-protein assessed as effect on calcium mobiliza...
In DepthDetails ArticlePubMed
TargetMuscarinic acetylcholine receptor M3(Homo sapiens (Human))
Glaxosmithkline
Curated by ChEMBL
LigandPNGBDBM50416731(CHEMBL1223941)
Affinity DataEC50:  3.98E+3nM. Assay description: Agonist activity at human muscarinic M3 receptor expressed in CHO cells assessed as effect on calcium mobilization by FLIPR assay
In DepthDetails ArticlePubMed