BDBM50416996 CHEMBL1257711
SMILES CCOc1cc(ccc1OC(C)=O)[C@@H]1Oc2nc(SCC=C)nnc2-c2ccccc2N1C(C)=O
InChI Key InChIKey=TYYWQKGOAITUAW-DEOSSOPVSA-N
Data  1 EC50
  Tab Delimited (TSV)   2D SDfile   Computed 3D by Vconf -m prep SDfile
Find this compound or compounds like it in BindingDB:
Activity Spreadsheet -- Enzyme Inhibition Constant Data from BindingDB
Found 1 hit for monomerid = 50416996
TargetMetabotropic glutamate receptor 5(Rattus norvegicus (Rat))
Vanderbilt University
Curated by ChEMBL
LigandPNGBDBM50416996(CHEMBL1257711)
Affinity DataEC50:  1.26E+3nM. Assay description: Inhibition of rat mGluR1 expressed in HEK293 cells
In DepthDetails ArticlePubMed