BDBM50417027 CHEMBL1256103
SMILES C[C@]12CC[C@H]3[C@@H](CCc4cc(O)ccc34)[C@@H]1CC[C@@]2(O)C\C=C\CC(F)(F)C(F)(F)C(F)(F)C(F)(F)C(F)(F)C(F)(F)F
InChI Key InChIKey=RRGDYECQEKIIAB-IEPWSMHYSA-N
Data  2 EC50
  Tab Delimited (TSV)   2D SDfile   Computed 3D by Vconf -m prep SDfile
Find this compound or compounds like it in BindingDB:
Activity Spreadsheet -- Enzyme Inhibition Constant Data from BindingDB
Found 2 hits for monomerid = 50417027
TargetEstrogen receptor(Homo sapiens (Human))
Charles University In Prague
Curated by ChEMBL
LigandPNGBDBM50417027(CHEMBL1256103)
Affinity DataEC50:  1.03E+3nM. Assay description: Agonist activity at ERalpha-LBD in human U2OS cells transfected with Gal4-DBD assessed as increase of transactivation activity after 18 hrs by lucife...
In DepthDetails ArticlePubMed
TargetEstrogen receptor beta(Homo sapiens (Human))
Charles University In Prague
Curated by ChEMBL
LigandPNGBDBM50417027(CHEMBL1256103)
Affinity DataEC50:  52nM. Assay description: Agonist activity at ERbeta-LBD in human U2OS cells transfected with Gal4-DBD assessed as increase of transactivation activity after 18 hrs by lucifer...
In DepthDetails ArticlePubMed