BDBM50417151 CHEMBL1270410
SMILES O=C(OCC#CCSc1nnc(o1)-c1cccc2ccccc12)c1ccco1
InChI Key InChIKey=YXJURGPAKADVMT-UHFFFAOYSA-N
Data  1 KI
  Tab Delimited (TSV)   2D SDfile   Computed 3D by Vconf -m prep SDfile
Find this compound or compounds like it in BindingDB:
Activity Spreadsheet -- Enzyme Inhibition Constant Data from BindingDB
Found 1 hit for monomerid = 50417151
TargetPolyunsaturated fatty acid lipoxygenase ALOX15(Homo sapiens (Human))
National Human Genome Research Institute
Curated by ChEMBL
LigandPNGBDBM50417151(CHEMBL1270410)
Affinity DataKi:  170nM. Assay description: Inhibition of human N-terminal His6-tagged reticulocyte 15-lipoxygenase-1 catalytic site assessed as 15-HPETE formation by Michaelis-Menten equation ...
In DepthDetails ArticlePubMed