BDBM50417322 CHEMBL1276742
SMILES CCN1CCC[C@H]1CNC(=O)c1cc(C)cc(O)c1OC
InChI Key InChIKey=AIZGIAFIDZOQAS-LBPRGKRZSA-N
Data  1 IC50
  Tab Delimited (TSV)   2D SDfile   Computed 3D by Vconf -m prep SDfile
Find this compound or compounds like it in BindingDB:
Activity Spreadsheet -- Enzyme Inhibition Constant Data from BindingDB
Found 1 hit for monomerid = 50417322
TargetD(2) dopamine receptor(Homo sapiens (Human))
University Of Mazandaran
Curated by ChEMBL
LigandPNGBDBM50417322(CHEMBL1276742)
Affinity DataIC50:  19.1nM. Assay description: Antagonist activity at dopamine D2 receptor
In DepthDetails ArticlePubMed