BDBM50417572 CHEMBL1642153
SMILES CC(C)S(=O)(=O)N[C@H]1Cc2ccc(Cn3cc(CF)c(n3)C(F)(F)F)cc2C1
InChI Key InChIKey=XBYSJXOTVTWNKI-INIZCTEOSA-N
Data  1 EC50
  Tab Delimited (TSV)   2D SDfile   Computed 3D by Vconf -m prep SDfile
Find this compound or compounds like it in BindingDB:
Activity Spreadsheet -- Enzyme Inhibition Constant Data from BindingDB
Found 1 hit for monomerid = 50417572
TargetGlutamate receptor 2(Homo sapiens (Human))
Merck Research Laboratories
Curated by ChEMBL
LigandPNGBDBM50417572(CHEMBL1642153)
Affinity DataEC50:  1.26E+3nM. Assay description: Modulatory activity at GluA2 receptor LBD
In DepthDetails ArticlePubMed