BDBM50417627 CHEMBL1642378
SMILES Cc1ccccc1\C(=C/CCN1CCC[C@H](C1)C(O)=O)c1ccccc1
InChI Key InChIKey=LLKXPFRQTPXSFH-IDCRMVTHSA-N
Data  1 KI
  Tab Delimited (TSV)   2D SDfile   Computed 3D by Vconf -m prep SDfile
Find this compound or compounds like it in BindingDB:
Activity Spreadsheet -- Enzyme Inhibition Constant Data from BindingDB
Found 1 hit for monomerid = 50417627
TargetSodium- and chloride-dependent GABA transporter 1(Homo sapiens (Human))
Glaxosmithkline
Curated by ChEMBL
LigandPNGBDBM50417627(CHEMBL1642378)
Affinity DataKi:  20.4nM. Assay description: Displacement of [3H]Tiagabine from human recombinant GAT1 expressed in HEK293 cells by equilibrium binding assay
In DepthDetails ArticlePubMed