BDBM50417656 CHEMBL1642366
SMILES OC(=O)[C@@H]1CCCN(CC\C=C(/c2ccccc2)c2ccccc2C(F)(F)F)C1
InChI Key InChIKey=YBRSOQNKLWRTMO-LSCADSNKSA-N
Data  1 KI
  Tab Delimited (TSV)   2D SDfile   Computed 3D by Vconf -m prep SDfile
Find this compound or compounds like it in BindingDB:
Activity Spreadsheet -- Enzyme Inhibition Constant Data from BindingDB
Found 1 hit for monomerid = 50417656
TargetSodium- and chloride-dependent GABA transporter 1(Homo sapiens (Human))
Glaxosmithkline
Curated by ChEMBL
LigandPNGBDBM50417656(CHEMBL1642366)
Affinity DataKi:  1.91E+3nM. Assay description: Displacement of [3H]Tiagabine from human recombinant GAT1 expressed in HEK293 cells by equilibrium binding assay
In DepthDetails ArticlePubMed