BDBM50418189 CHEMBL1761696
SMILES C[C@H](NCc1c(noc1-c1ccc(cc1)C(F)(F)F)C(=O)N[C@@H]1CCC[C@H](O)C1)C(F)(F)F
InChI Key InChIKey=NNEPHZMMSYMBQT-GLQYFDAESA-N
Data  1 IC50
  Tab Delimited (TSV)   2D SDfile   Computed 3D by Vconf -m prep SDfile
Find this compound or compounds like it in BindingDB:
Activity Spreadsheet -- Enzyme Inhibition Constant Data from BindingDB
Found 1 hit for monomerid = 50418189
LigandPNGBDBM50418189(CHEMBL1761696)
Affinity DataIC50:  0.158nM. Assay description: Antagonist activity at human TRPV1 expressed in CHO-K1 cells assessed as inhibition of capsaicin-induced intracellular Ca2+ influx by FLIPR assay
In DepthDetails ArticlePubMed