BDBM50418197 CHEMBL1761705
SMILES CN(CCS(C)(=O)=O)Cc1c(noc1-c1ccc(cc1)C(F)(F)F)C(=O)N[C@@H]1CCC[C@H](O)C1
InChI Key InChIKey=HLPIEPZFWBATOO-SJORKVTESA-N
Data  1 IC50
  Tab Delimited (TSV)   2D SDfile   Computed 3D by Vconf -m prep SDfile
Find this compound or compounds like it in BindingDB:
Activity Spreadsheet -- Enzyme Inhibition Constant Data from BindingDB
Found 1 hit for monomerid = 50418197
LigandPNGBDBM50418197(CHEMBL1761705)
Affinity DataIC50:  1.26E+3nM. Assay description: Antagonist activity at human TRPV1 expressed in CHO-K1 cells assessed as inhibition of capsaicin-induced intracellular Ca2+ influx by FLIPR assay
In DepthDetails ArticlePubMed