BDBM50418394 CHEMBL1773860
SMILES COc1cc(C)c(c(C)c1C)S(=O)(=O)N[C@@H](CC1CCCCC1)C(=O)N(CCCN1CCN(C)CC1)Cc1ccccc1
InChI Key InChIKey=RTLIFYHBQGTFTA-HKBQPEDESA-N
Data  1 KI
  Tab Delimited (TSV)   2D SDfile   Computed 3D by Vconf -m prep SDfile
Find this compound or compounds like it in BindingDB:
Activity Spreadsheet -- Enzyme Inhibition Constant Data from BindingDB
Found 1 hit for monomerid = 50418394
TargetVasopressin V1a receptor(Homo sapiens (Human))
Msd
Curated by ChEMBL
LigandPNGBDBM50418394(CHEMBL1773860)
Affinity DataKi:  148nM. Assay description: Displacement of [3H]AVP from human V1A receptor expressed in CHO cells
In DepthDetails ArticlePubMed