BDBM50418827 CHEMBL1796289
SMILES O=C(NCc1ccncc1)c1ccc(cc1)-c1ccccc1
InChI Key InChIKey=JBXPVMOIWQIHRH-UHFFFAOYSA-N
Data  1 IC50
  Tab Delimited (TSV)   2D SDfile   Computed 3D by Vconf -m prep SDfile
Find this compound or compounds like it in BindingDB:
Activity Spreadsheet -- Enzyme Inhibition Constant Data from BindingDB
Found 1 hit for monomerid = 50418827
TargetCollagenase 3(Homo sapiens (Human))
Astrazeneca
Curated by ChEMBL
LigandPNGBDBM50418827(CHEMBL1796289)
Affinity DataIC50:  3.98E+4nM. Assay description: Inhibition of human recombinant MMP13 using Mca-Pro-cyclohexyl-Ala-Gly-Nva-His-Ala-Dap(Dnp)-NH2 substrate
In DepthDetails ArticlePubMed