BDBM50419149 CHEMBL1829167
SMILES OC(=O)CCc1ccc(cc1)C#Cc1ccnc(Cl)c1CC=C
InChI Key InChIKey=JFVRKDBXQCMSTP-UHFFFAOYSA-N
Data  1 EC50
  Tab Delimited (TSV)   2D SDfile   Computed 3D by Vconf -m prep SDfile
Find this compound or compounds like it in BindingDB:
Activity Spreadsheet -- Enzyme Inhibition Constant Data from BindingDB
Found 1 hit for monomerid = 50419149
TargetFree fatty acid receptor 1(Homo sapiens (Human))
University Of Southern Denmark
Curated by ChEMBL
LigandPNGBDBM50419149(CHEMBL1829167)
Affinity DataEC50:  316nM. Assay description: Agonist activity at human FFA1 receptor expressed in human 1321N1 cells assessed as calcium mobilization by fluorescence spectrophotometry
In DepthDetails ArticlePubMed